BDBM76682 (5E)-3-benzyl-5-(3,4-dihydroxybenzylidene)-2-thioxo-1,3-thiazolidin-4-one::(5E)-3-benzyl-5-(3,4-dihydroxybenzylidene)-2-thioxo-thiazolidin-4-one::(5E)-3-benzyl-5-[(3,4-dihydroxyphenyl)methylidene]-2-sulfanylidene-1,3-thiazolidin-4-one::(5E)-5-[(3,4-dihydroxyphenyl)methylidene]-3-(phenylmethyl)-2-sulfanylidene-4-thiazolidinone::(5E)-5-[[3,4-bis(oxidanyl)phenyl]methylidene]-3-(phenylmethyl)-2-sulfanylidene-1,3-thiazolidin-4-one::MLS001194433::SMR000555226::cid_2054727
SMILES Oc1ccc(\C=C2\SC(=S)N(Cc3ccccc3)C2=O)cc1O
InChI Key InChIKey=SHALFGFJUXKVHA-OQLLNIDSSA-N
Data  3 IC50
  Tab Delimited (TSV)   2D SDfile   Computed 3D by Vconf -m prep SDfile
Find this compound or compounds like it in BindingDB:
Activity Spreadsheet -- Enzyme Inhibition Constant Data from BindingDB
Found 3 hits for monomerid = 76682
TargetSentrin-specific protease 6(Homo sapiens (Human))
Burnham Center For Chemical Genomics
Curated by PubChem BioAssay
LigandPNGBDBM76682((5E)-3-benzyl-5-(3,4-dihydroxybenzylidene)-2-thiox...)
Affinity DataIC50:  1.15E+4nM. Assay description: Data Source: Sanford-Burnham Center for Chemical Genomics (SBCCG) Source Affiliation: Sanford-Burnham Medical Research Institute (SBMRI, San Diego, C...
In DepthDetails PCBioAssay
TargetSentrin-specific protease 8(Homo sapiens (Human))
Burnham Center For Chemical Genomics
Curated by PubChem BioAssay
LigandPNGBDBM76682((5E)-3-benzyl-5-(3,4-dihydroxybenzylidene)-2-thiox...)
Affinity DataIC50:  1.07E+4nM. Assay description: Data Source: Sanford-Burnham Center for Chemical Genomics (SBCCG) Source Affiliation: Sanford-Burnham Medical Research Institute (SBMRI, San Diego, C...
In DepthDetails PCBioAssay
TargetCaspase-3(Homo sapiens (Human))
Burnham Center For Chemical Genomics
Curated by PubChem BioAssay
LigandPNGBDBM76682((5E)-3-benzyl-5-(3,4-dihydroxybenzylidene)-2-thiox...)
Affinity DataIC50:  6.75E+4nM. Assay description: Data Source: Sanford-Burnham Center for Chemical Genomics (SBCCG) Source Affiliation: Sanford-Burnham Medical Research Institute (SBMRI, San Diego, C...
In DepthDetails PCBioAssay